1. Ce site utilise des cookies. En continuant à utiliser ce site, vous acceptez l'utilisation des cookies. En savoir plus.
  2. Bonjour tout le monde ! Veillez consulter la Politique de forum pour comprendre nos règles, Merci a vous !
    Rejeter la notice

WM Erreur de génération APK sous WM23

Discussion dans 'Windev Mobile' créé par Man, Avr 8, 2019.

Tags:
  1. Man

    Man Active Member

    Inscrit:
    Juil 9, 2018
    Messages:
    164
    J'aime reçus:
    34
    Bonjour à vous les Bao, je viens ici poser mon problème de génération de l'APK avec WM23. L'erreur rencontrée est dans la pièce jointe à ce message.
    Je suis preneur de toutes proposition de solutions
     

    Fichiers attachés:

    Tags:
  2. khaliassas

    khaliassas Active Member

    Inscrit:
    Mar 4, 2019
    Messages:
    131
    J'aime reçus:
    48
    j'ai trouve ca sur pcsoft pour info

    Bonjour visiteur, Merci de vous Inscrire ou de vous connectez pour voir les liens!

     
  3. Man

    Man Active Member

    Inscrit:
    Juil 9, 2018
    Messages:
    164
    J'aime reçus:
    34

    Bonjour visiteur, Merci de vous Inscrire ou de vous connectez pour voir les liens!

    Je ne comprend pas
    AS-tu une idée ?
    ou bien quelle version de gradle devrais-je utiliser ?
     
  4. Man

    Man Active Member

    Inscrit:
    Juil 9, 2018
    Messages:
    164
    J'aime reçus:
    34

    Bonjour visiteur, Merci de vous Inscrire ou de vous connectez pour voir les liens!

    , je viens de lire le document mais je ne comprend rien tout au moins ça ne réoud pas mon problème
    Help me please !!!!
     
  5. khaliassas

    khaliassas Active Member

    Inscrit:
    Mar 4, 2019
    Messages:
    131
    J'aime reçus:
    48
    quelle sont tes parametres de compilation
    il recommande d'etre en automatique.
     

    Fichiers attachés:

  6. Man

    Man Active Member

    Inscrit:
    Juil 9, 2018
    Messages:
    164
    J'aime reçus:
    34

    Bonjour visiteur, Merci de vous Inscrire ou de vous connectez pour voir les liens!

    voici en pièce jointe les paramètres
     

    Fichiers attachés:

  7. khaliassas

    khaliassas Active Member

    Inscrit:
    Mar 4, 2019
    Messages:
    131
    J'aime reçus:
    48
    tu as essayer " telecharger et installer automatiquement "?
     
  8. Man

    Man Active Member

    Inscrit:
    Juil 9, 2018
    Messages:
    164
    J'aime reçus:
    34

    Bonjour visiteur, Merci de vous Inscrire ou de vous connectez pour voir les liens!

    tu as essayer " telecharger et installer automatiquement "?
    Cliquez pour agrandir...

    Bonjour visiteur, Merci de vous Inscrire ou de vous connectez pour voir les liens!

    voici l'erreur que j'ai maintenant
    ///////////////////////////////////////////////////////////////////////////////////////////////////////////////////////////////////////////////////////////////////////////////////////////
    Echec de la création de l'application Android <C:\Mes Projets Mobile\SUPPTIC\Exe\SUP_PTIC Mobile.apk>.


    Ligne de commande : "C:\Program Files\Java\jdk1.8.0_181\bin\java.exe" "-Dorg.gradle.appname=C:\Mes Projets Mobile\SUPPTIC\Android\Gen" -classpath "C:\gradle-4.4.1\lib\gradle-launcher-4.4.1.jar" org.gradle.launcher.GradleMain assembleRelease -b "C:\Mes Projets Mobile\SUPPTIC\Android\Gen\build.gradle"


    Erreur retournée :
    WARNING: The `android.dexOptions.incremental` property is deprecated and it has no effect on the build process.
    Download

    Bonjour visiteur, Merci de vous Inscrire ou de vous connectez pour voir les liens!


    Download

    Bonjour visiteur, Merci de vous Inscrire ou de vous connectez pour voir les liens!


    Download

    Bonjour visiteur, Merci de vous Inscrire ou de vous connectez pour voir les liens!


    Download

    Bonjour visiteur, Merci de vous Inscrire ou de vous connectez pour voir les liens!


    Download

    Bonjour visiteur, Merci de vous Inscrire ou de vous connectez pour voir les liens!


    The CompileOptions.bootClasspath property has been deprecated and is scheduled to be removed in Gradle 5.0. Please use the CompileOptions.bootstrapClasspath property instead.

    FAILURE: Build failed with an exception.

    * What went wrong:
    A problem occurred configuring root project 'Gen'.
    > Failed to notify project evaluation listener.
    > com.android.build.gradle.tasks.factory.AndroidJavaCompile.setDependencyCacheDir(Ljava/io/File;)V

    * Try:
    Run with --stacktrace option to get the stack trace. Run with --info or --debug option to get more log output. Run with --scan to get full insights.

    * Get more help at

    Bonjour visiteur, Merci de vous Inscrire ou de vous connectez pour voir les liens!



    BUILD FAILED in 10m 55s
     
  • khaliassas

    khaliassas Active Member

    Inscrit:
    Mar 4, 2019
    Messages:
    131
    J'aime reçus:
    48
    tu peux essayer de supprimer :
    "C:\USERS\votre nom utilisateur\APPDATA\LOCAL\TEMP\FRMK_Android_XX.XXXX.FR"

    pour voir
     
  • Man

    Man Active Member

    Inscrit:
    Juil 9, 2018
    Messages:
    164
    J'aime reçus:
    34

    Bonjour visiteur, Merci de vous Inscrire ou de vous connectez pour voir les liens!

    tu peux essayer de supprimer :
    "C:\USERS\votre nom utilisateur\APPDATA\LOCAL\TEMP\FRMK_Android_XX.XXXX.FR"

    pour voir
    Cliquez pour agrandir...
    Ok je le fais et je te rend compte
     
  • Man

    Man Active Member

    Inscrit:
    Juil 9, 2018
    Messages:
    164
    J'aime reçus:
    34

    Bonjour visiteur, Merci de vous Inscrire ou de vous connectez pour voir les liens!

    Bonjour, je viens vers toi te faire état de ta solution justement il fallait le le faire mais l'erreur persistait il fallait que la version de mon gradle soit à 2.4.xx ce que j'ai fais et j'ai pu compiler. Merci pour ses tentatives de solutions.
    J'ai un autre problème que je poserai sous forme d'une nouvelle discussion
     
  • forumwindev

    forumwindev New Member

    Inscrit:
    Juil 23, 2018
    Messages:
    23
    J'aime reçus:
    8
    Bonjour l'équipe.
    Moi aussi j'ai toujours cet erreur:

    Echec de la création de l'application Android <C:\Mes Projets Mobile\CP\Exe\CP.apk>.


    Ligne de commande : "C:\Program Files\Java\jdk1.8.0_172\bin\java.exe" "-Dorg.gradle.appname=C:\Mes Projets Mobile\CP\Android\Generation" -classpath "C:\windev mobile 23\Personnel\Android\Gradle\lib\gradle-launcher-2.14.1.jar" org.gradle.launcher.GradleMain assembleDebug -b "C:\Mes Projets Mobile\CP\Android\Generation\build.gradle"


    Erreur retournée :

    FAILURE: Build failed with an exception.

    * What went wrong:
    A problem occurred configuring root project 'Generation'.
    > Could not resolve all dependencies for configuration ':classpath'.
    > Could not resolve com.android.tools.build:gradle:2.2.0.
    Required by:
    :Generation:unspecified
    > Could not resolve com.android.tools.build:gradle:2.2.0.
    > Could not get resource '

    Bonjour visiteur, Merci de vous Inscrire ou de vous connectez pour voir les liens!

    '.
    > Could not GET '

    Bonjour visiteur, Merci de vous Inscrire ou de vous connectez pour voir les liens!

    '.
    > jcenter.bintray.com

    * Try:
    Run with --stacktrace option to get the stack trace. Run with --info or --debug option to get more log output.

    BUILD FAILED

    Total time: 18.625 secs

    Même en créant un nouveau projet, mias ne fonctionne pas toujours.

    Ma version de gradle est 2.14.1 télécharger par WM 23 automatique avec le SDK.

    Besoin d'aide s'il vous plait.
     
  • Man

    Man Active Member

    Inscrit:
    Juil 9, 2018
    Messages:
    164
    J'aime reçus:
    34

    Bonjour visiteur, Merci de vous Inscrire ou de vous connectez pour voir les liens!

    Bonjour l'équipe.
    Moi aussi j'ai toujours cet erreur:

    Echec de la création de l'application Android <C:\Mes Projets Mobile\CP\Exe\CP.apk>.


    Ligne de commande : "C:\Program Files\Java\jdk1.8.0_172\bin\java.exe" "-Dorg.gradle.appname=C:\Mes Projets Mobile\CP\Android\Generation" -classpath "C:\windev mobile 23\Personnel\Android\Gradle\lib\gradle-launcher-2.14.1.jar" org.gradle.launcher.GradleMain assembleDebug -b "C:\Mes Projets Mobile\CP\Android\Generation\build.gradle"


    Erreur retournée :

    FAILURE: Build failed with an exception.

    * What went wrong:
    A problem occurred configuring root project 'Generation'.
    > Could not resolve all dependencies for configuration ':classpath'.
    > Could not resolve com.android.tools.build:gradle:2.2.0.
    Required by:
    :Generation:unspecified
    > Could not resolve com.android.tools.build:gradle:2.2.0.
    > Could not get resource '

    Bonjour visiteur, Merci de vous Inscrire ou de vous connectez pour voir les liens!

    '.
    > Could not GET '

    Bonjour visiteur, Merci de vous Inscrire ou de vous connectez pour voir les liens!

    '.
    > jcenter.bintray.com

    * Try:
    Run with --stacktrace option to get the stack trace. Run with --info or --debug option to get more log output.

    BUILD FAILED

    Total time: 18.625 secs

    Même en créant un nouveau projet, mias ne fonctionne pas toujours.

    Ma version de gradle est 2.14.1 télécharger par WM 23 automatique avec le SDK.

    Besoin d'aide s'il vous plait.
    Cliquez pour agrandir...

    Bonjour visiteur, Merci de vous Inscrire ou de vous connectez pour voir les liens!

    Bonsoir essaye de mettre à jour ton SDK Android
     
  • forumwindev

    forumwindev New Member

    Inscrit:
    Juil 23, 2018
    Messages:
    23
    J'aime reçus:
    8

    Bonjour visiteur, Merci de vous Inscrire ou de vous connectez pour voir les liens!

    Je vais tester.
     
  • khaliassas

    khaliassas Active Member

    Inscrit:
    Mar 4, 2019
    Messages:
    131
    J'aime reçus:
    48

    Bonjour visiteur, Merci de vous Inscrire ou de vous connectez pour voir les liens!

    Bonjour visiteur, Merci de vous Inscrire ou de vous connectez pour voir les liens!

    Je vais tester.
    Cliquez pour agrandir...
    as tu testé en supprimant ça :
    "C:\USERS\votre nom utilisateur\APPDATA\LOCAL\TEMP\FRMK_Android_XX.XXXX.FR"
     
  • forumwindev

    forumwindev New Member

    Inscrit:
    Juil 23, 2018
    Messages:
    23
    J'aime reçus:
    8

    Bonjour visiteur, Merci de vous Inscrire ou de vous connectez pour voir les liens!

    J'ai déjà essayer d'effacer le dossier FRMK_ mais toujours erreur.
    Je vais essayer de mettre à jour mon SDK et je vais voir.
     
  • forumwindev

    forumwindev New Member

    Inscrit:
    Juil 23, 2018
    Messages:
    23
    J'aime reçus:
    8

    Bonjour visiteur, Merci de vous Inscrire ou de vous connectez pour voir les liens!

    Après mise à jour de JAVA JDK, ça a marché.
     
    WX1331, Man et khaliassas aiment ça.
  • Partager cette page

    Chargement...